{"text_format":"1","workbook":"xlsx","n_sheets":6,"sheets":["Overview (LTP)","Lesson hours 2","Cover Sheet - Spring Term","STP Year 12","Mastery Matrix","Lists"],"not_rendered":{"charts":0,"images":2,"macros":0,"external_links":0,"defined_names":41,"comments":0,"pivot_tables":0},"unopened":[],"bounds":{"document_bytes":16777216,"sheet_cells":100000,"rows_first":2000,"rows_last":500,"rows_between":2000,"halvings":0,"cell_chars":16384,"cell_head_chars":4096},"cells_cut":0,"cells_raw":0,"read":"whole","date_system":"1900"}

{"sheet":"Overview (LTP)","index":0,"n_rows":53,"n_cols":11,"rows_kept":53,"cut":false,"hidden":false,"merged":[]}
[]
[null,null,null,null,null,null,null,null,"Topic Overview: CNSS "]
[]
[null,null,null,null,null,"Year 9- 2020-2023 cohort","Topic","Single","Double","Unit","EXAMS"]
[null,null,null,null,null,"Autumn 1","RO41: Reducing risk of sports injuries","RO41","RO41 + practical- practical sporting award?","LO1-2"]
[null,null,null,null,null,"Autumn 2","RO41: Reducing risk of sports injuries","RO41","RO41 + practical?","LO2-3","Mock?"]
[null,null,null,null,null,"Spring 1","RO41: Reducing risk of sports injuries","R041","RO41 + practical?","LO3-4","Mock"]
[null,null,null,null,null,"Spring 2","RO42: Applying principles of training ","RO42","RO42 + practical?","LO1-2"]
[null,null,null,null,null,"Summer 1","RO42: Applying principles of training ","RO42","R042 + practical?","LO2-3"]
[null,null,null,null,null,"Summer 2","RO42: Applying principles of training ","RO42","R042 + practical?","LO3-4"]
[]
[]
[null,null,null,null,null,"Year 10- 2020-2023 cohort","Topic","Single","Double","Unit","Exam"]
[null,null,1,8,{"$f":"#REF!","v":{"$error":"#REF!"}},"Autumn 1","R045: Sports Nutrition ","RO45","RO45 + practical?","LO1-2"]
[null,null,2,8,{"$f":"E14","v":{"$error":"#REF!"}},"Autumn 2","R045: Sports Nutrition ","RO45","RO45 + practical?","LO2-3"]
{"$rows_left_out":39}
{"sheet":"Lesson hours 2","index":1,"n_rows":21,"n_cols":9,"rows_kept":21,"cut":false,"hidden":true,"merged":[]}
["Year 12",null,"In class hour allocations "]
["HT","Topic","Lessons (hours)","RP (hours)","Additional Practicals (hours)","Assessment (hours)","HW (hours)","Max hours","Spare"]
[1,"Atomic structure",4,null,null,null,0.5,28,{"$f":"H3-(C3+C4+D4+E4+F5+F4+G4+C5)","v":2}]
[null,"Amount of Substance",7,2,2,1.5]
[null,"Bonding",8,null,null,1.5]
[2,"Energetics",8,2,1,null,0.5,36,{"$f":"H6-(C6+C7+C8+C9+D6+D7+E6+E7+F8+F9+G6)","v":3.5}]
[null,"Kinetics",3,2,1]
[null,"Equilibria",7,null,null,1.5]
[null,"Oxidation, reduction and redox reactions",5,null,null,1.5]
[3,"Periodicity ",5,null,null,1.5,0.5,28,{"$f":"H10-(C10+C11+C12+D12+E11+F11+F10+G10)","v":7.5}]
[null,"Group 2",2,null,1,1.5]
[null,"Group 7",5,4]
[4,"Introduction to Organic chemistry ",4,null,null,1.5,0.5,29,{"$f":"H13-(C13+C15+C14+E15+F13+F14+G13)","v":8.5}]
[null,"Alkanes",7,null,null,1.5]
[null,"Halogenalkanes",5,null,1]
{"$rows_left_out":7}
{"sheet":"Cover Sheet - Spring Term","index":2,"n_rows":981,"n_cols":10,"rows_kept":981,"cut":false,"hidden":false,"merged":[]}
[null,null,null,null,null,null,null,"RAG"]
[null,"Paper","Unit","Topic/chapter","Year Group","Learning statement","Textbook page number ",1,2,3]
[null,"Paper 1","Applied Anatomy and Physiology ","Understand the functions of the skeletal system",11,"Name the location of the major bones of the body\nDescribe the 6 functions of the skeleton\n","22  to 24"]
[null,"Paper 1","Applied Anatomy and Physiology ","Understand the types of synovial joints",11,"Name the 2 major joint groups\nDescribe what a synovial joint is and examples of these joints\nGive examples of the articulating bones and types of movement possible at these joints\nDefine ligaments, tendons and cartilage ","22  to 24"]
[null,"Paper 1","Applied Anatomy and Physiology ","Understand the location and roles of the major muscles",11,"Recall the name and location of the major muscles\nExplain the roles of antagonistic pairs and fixators in movement ","25 to 26"]
[null,"Paper 1","Applied Anatomy and Physiology ","Understand the lever systems ",11,"Recall the 3 classes of levers and their use in physical activity and sport \nDescribe sporting examples of each of the three classes of levers\nDescribe the term mechanical advantage and give practical sporting examples of it","27 to29"]
[null,"Paper 1","Applied Anatomy and Physiology ","Understand the planes of movement and axes of rotation ",11,"Identify where the three planes of movement and axes of rotation are found in the body \nIdentify which plane of movement pairs with which axis of rotation \nDescribe the movements possible at the three planes of movement and axes of rotation with practical sporting examples \nDescribe types of movement within each axis of rotation  ","27 to29"]
[null,"Paper 1","Applied Anatomy and Physiology ","Describe the structure and function of the human heart with the cardiovascular system",11,"Label a diagram of the heart\nDescribe the pathway of blood through the heart\nExplain the function of the different parts of the heart\nDescribe and explain the double-circulatory system","27 to29"]
[null,"Paper 1","Applied Anatomy and Physiology ","Understand the function of the major blood vessels and the cardiac values ",11,"Recall the 3 different types of blood vessel\nDescribe the structural features of the 3 major blood vessels \nDescribe the role of red blood cells in oxygen transport\nCalculate the rate of blood flow and cardiac output","27 to29"]
[null,"Paper 1","Applied Anatomy and Physiology ","Understand ventilation within the respiratory system",11,"Label the features of the human lungs \nRecall the pathway of air through the respiratory system\nDescribe the role of the respiratory muscles in ventilation Calculate minute ventilation using tidal volume and breathing rate","30 to 34"]
[null,"Paper 1","Applied Anatomy and Physiology ","Understand the process of gas exchange ",11,"Define gas exchange \nDescribe and explain where gas exchange takes place \nExplain the adaptations of the alveoli","30 to 34"]
[null,"Paper 1","Applied Anatomy and Physiology ","Explain the process of aerobic and anaerobic exercise",11,"Recall the word equations for aerobic and anaerobic respiration\nGive practical sporting examples of aerobic exercises and anaerobic exercises\nExplain which type of respiration is used depending on intensity and duration\n","30 to 34"]
[null,"Paper 1","Applied Anatomy and Physiology ","Explain the short term effects of exercise on the cardiac, respiratory, muscular and vascular systems",11,"Recall the 4 key body systems that are affected by short term exercise\nDescribe the short term effects of exercise on:\n- muscle temperature\n- heart rate, stroke volume and cardiac output\n- redistribution of blood flow during exercise \n- respiratory rate, tidal volume, minute ventilation\n- oxygen to the working muscles\n- lactic acid production\nInterpret graphs related to this","34-39"]
[null,"Paper 1","Applied Anatomy and Physiology ","Explain the long-term (training) effects of exercise on the bodily systems",11,"Describe the long-term effects of exercise on: \n- bone density\n- hypertrophy of muscle \n- muscular strength \n- muscular endurance\n- resistance to fatigue\n- hypertrophy of the heart\n- resting heart rate and resting stroke volume\n- cardiac output\n- rate of recovery\n- aerobic capacity\n- respiratory muscles\n- tidal volume and minute volume during exercise\n- capillarisation \nApply these long term effects to examples from physical activity \nTo collect and use data relating to long-term effects of exercise.","40-45"]
[null,"Paper 1","Physical Training ","Describe and explain the component of fitness: Cardiovascular endurance/ stamina ",11,"Define cardiovascular endurance/ stamina \nApply practical examples where this component is particularly important in physical activity and sport \nRecall suitable tests for this component, including: Cooper 12 minute run/ walk test & Multi-stage fitness test ","48-51"]
{"$rows_left_out":967}
{"sheet":"STP Year 12","index":3,"n_rows":82,"n_cols":11,"rows_kept":82,"cut":false,"hidden":true,"merged":[]}
[null,null,"Year 12 Chem Short Term Plan"]
[]
["Number","Topic ","Lesson","Objective","Success criteria","Tasks","CFU","Math skills","Practical skills","Misconceptions","Homework"]
[1,"Atomic structure","The structure of atoms 3.1.1.1","Draw and describe the structure of the atom","State the relative masses and charges of protons, neutrons and electrons"]
[null,null,null,null,"Identify and represent the number of protons, neutrons and electrons are arranged in an atom or ion"]
[null,null,null,null,"Describe the development of the strucutre of the atom from Dalton to Schrodinger "]
[2,"Atomic structure","Mass number and Isotopes 3.1.1.2","Describe and explain the properties and structure of isotopes","Define the term mass number, atomic number and isotope"]
[null,null,null,null,"Identify and explain why symbols or drawings of various elements are isotopes"]
[null,null,null,null,"Explain why isotopes of the same element have identical chemical properties "]
[3,"Amount of substance","Relative atomic/molecular mass and the mole 3.1.2.1/2","Describe and explain how atomic and molecular mass relates to the mole","Define relative atomic mass in terms of C12"]
[null,null,null,null,"Define relative molecular mass in terms of C12"]
[null,null,null,null,"Explain the meaning of Avogadro's constant (the constant will be given in the exam). Carry out calculations using Avogadro's constant and convert answers to and from standard form \n"]
[4,"Amount of substance","Mole and Avogadro's number calculations 3.1.2.2"]
[]
[]
{"$rows_left_out":68}
{"sheet":"Mastery Matrix","index":4,"n_rows":81,"n_cols":22,"rows_kept":81,"cut":false,"hidden":true,"merged":[[3,17,3,18],[5,15,5,17],[2,11,3,11],[1,7,1,11],[5,10,5,12],[5,1,6,1],[18,49,19,49],[5,49,7,49],[8,49,9,49],[10,49,11,49],[14,49,15,49],[16,49,17,49]]}
[]
[null,null,null,null,null,null,null,"Science Mastery Matrix"]
[null,null,null,null,null,null,null,null,null,null,null,"Year Group","Year 9",null,null,null,"Subject","Biology"]
[null,null,{"$f":"IF(M3=\"\",\"\",VLOOKUP(M3,Lists!A2:B6,2,FALSE))","v":9},{"$f":"CONCATENATE(C4,\".\",N4,\".\",V4,\".\")","v":{"$error":"#N/A"}},null,null,null,null,null,null,null,null,null,{"$f":"IF(R3=\"\",\"\",VLOOKUP(R3,Lists!A12:B14,2,FALSE))","v":"B"},{"$f":"CONCATENATE(SUBSTITUTE(M3,\" \",\"\"),R3)","v":"Year9Biology"},null,"Unit","Cell Biology",null,null,null,{"$f":"IF(R4=\"\",\"\",VLOOKUP($R$4,'Cover Sheet - Spring Term'!$B$2:$J$918,2,FALSE))","v":{"$error":"#N/A"}}]
[]
[null,"No.",null,null,null,"No.","Topic","Learning Statement","Tier","Course","Revision Guide",null,null,null,null,"RAG"]
[null,null,null,null,null,null,null,null,null,null,"KS3","Double","Triple",null,null,1,2,3]
[null,1,{"$f":"CONCATENATE($D$4,B8)","v":{"$error":"#N/A"}},{"$f":"IFERROR(IF(C8=\"\",\"\",VLOOKUP(C8,'Cover Sheet - Spring Term'!$D$2:$F$942,7,FALSE)),\"\")","v":""},{"$f":"IF(H8=\"\",\"\",VLOOKUP(H8,'Cover Sheet - Spring Term'!$F$3:$J$918,3,FALSE))","v":""},{"$f":"IF(E8=\"\",\"\",SUBSTITUTE(E8,$D$4,\"\"))","v":""},{"$f":"D8","v":""},null,{"$f":"IFERROR(IF(C8=\"\",\"\",VLOOKUP(C8,'Cover Sheet - Spring Term'!$D$2:$J$942,11,FALSE)),\"\")","v":""},{"$f":"IFERROR(IF(C8=\"\",\"\",VLOOKUP(C8,'Cover Sheet - Spring Term'!$D$2:$J$942,10,FALSE)),\"\")","v":""},{"$f":"IFERROR(IF(B8=\"\",\"\",VLOOKUP(B8,'Cover Sheet - Spring Term'!$D$2:$J$942,12,FALSE)),\"\")","v":""},{"$f":"IFERROR(IF(C8=\"\",\"\",VLOOKUP(C8,'Cover Sheet - Spring Term'!$D$2:$J$942,13,FALSE)),\"\")","v":""},{"$f":"IFERROR(IF(D8=\"\",\"\",VLOOKUP(C8,'Cover Sheet - Spring Term'!$D$2:$J$942,14,FALSE)),\"\")","v":""}]
[null,{"$f":"IFERROR(IF(H8=\"\",\"\",B8+1),\"\")","v":""},{"$error":"#N/A"},{"$f":"IFERROR(IF(C9=\"\",\"\",VLOOKUP(C9,'Cover Sheet - Spring Term'!$D$2:$F$942,7,FALSE)),\"\")","v":""},{"$f":"IF(H9=\"\",\"\",VLOOKUP(H9,'Cover Sheet - Spring Term'!$F$3:$J$918,3,FALSE))","v":""},{"$f":"IF(E9=\"\",\"\",SUBSTITUTE(E9,$D$4,\"\"))","v":""},{"$f":"IFERROR(IF(D9=D8,\"\",D9),\"\")","v":""},{"$f":"IFERROR(IF(C9=\"\",\"\",VLOOKUP(C9,'Cover Sheet - Spring Term'!$D$2:$J$942,18,FALSE)),\"\")","v":""},{"$f":"IFERROR(IF(C9=\"\",\"\",VLOOKUP(C9,'Cover Sheet - Spring Term'!$D$2:$J$942,11,FALSE)),\"\")","v":""},{"$f":"IFERROR(IF(C9=\"\",\"\",VLOOKUP(C9,'Cover Sheet - Spring Term'!$D$2:$J$942,10,FALSE)),\"\")","v":""},{"$f":"IFERROR(IF(B9=\"\",\"\",VLOOKUP(B9,'Cover Sheet - Spring Term'!$D$2:$J$942,12,FALSE)),\"\")","v":""},{"$f":"IFERROR(IF(C9=\"\",\"\",VLOOKUP(C9,'Cover Sheet - Spring Term'!$D$2:$J$942,13,FALSE)),\"\")","v":""},{"$f":"IFERROR(IF(D9=\"\",\"\",VLOOKUP(C9,'Cover Sheet - Spring Term'!$D$2:$J$942,14,FALSE)),\"\")","v":""}]
[null,"",{"$error":"#N/A"},{"$f":"IFERROR(IF(C10=\"\",\"\",VLOOKUP(C10,'Cover Sheet - Spring Term'!$D$2:$F$942,7,FALSE)),\"\")","v":""},{"$f":"IF(H10=\"\",\"\",VLOOKUP(H10,'Cover Sheet - Spring Term'!$F$3:$J$918,3,FALSE))","v":""},{"$f":"IF(E10=\"\",\"\",SUBSTITUTE(E10,$D$4,\"\"))","v":""},"",{"$f":"IFERROR(IF(C10=\"\",\"\",VLOOKUP(C10,'Cover Sheet - Spring Term'!$D$2:$J$942,18,FALSE)),\"\")","v":""},{"$f":"IFERROR(IF(C10=\"\",\"\",VLOOKUP(C10,'Cover Sheet - Spring Term'!$D$2:$J$942,11,FALSE)),\"\")","v":""},{"$f":"IFERROR(IF(C10=\"\",\"\",VLOOKUP(C10,'Cover Sheet - Spring Term'!$D$2:$J$942,10,FALSE)),\"\")","v":""},{"$f":"IFERROR(IF(B10=\"\",\"\",VLOOKUP(B10,'Cover Sheet - Spring Term'!$D$2:$J$942,12,FALSE)),\"\")","v":""},{"$f":"IFERROR(IF(C10=\"\",\"\",VLOOKUP(C10,'Cover Sheet - Spring Term'!$D$2:$J$942,13,FALSE)),\"\")","v":""},{"$f":"IFERROR(IF(D10=\"\",\"\",VLOOKUP(C10,'Cover Sheet - Spring Term'!$D$2:$J$942,14,FALSE)),\"\")","v":""}]
[null,"",{"$error":"#N/A"},{"$f":"IFERROR(IF(C11=\"\",\"\",VLOOKUP(C11,'Cover Sheet - Spring Term'!$D$2:$F$942,7,FALSE)),\"\")","v":""},{"$f":"IF(H11=\"\",\"\",VLOOKUP(H11,'Cover Sheet - Spring Term'!$F$3:$J$918,3,FALSE))","v":""},"","",{"$f":"IFERROR(IF(C11=\"\",\"\",VLOOKUP(C11,'Cover Sheet - Spring Term'!$D$2:$J$942,18,FALSE)),\"\")","v":""},{"$f":"IFERROR(IF(C11=\"\",\"\",VLOOKUP(C11,'Cover Sheet - Spring Term'!$D$2:$J$942,11,FALSE)),\"\")","v":""},{"$f":"IFERROR(IF(C11=\"\",\"\",VLOOKUP(C11,'Cover Sheet - Spring Term'!$D$2:$J$942,10,FALSE)),\"\")","v":""},{"$f":"IFERROR(IF(B11=\"\",\"\",VLOOKUP(B11,'Cover Sheet - Spring Term'!$D$2:$J$942,12,FALSE)),\"\")","v":""},{"$f":"IFERROR(IF(C11=\"\",\"\",VLOOKUP(C11,'Cover Sheet - Spring Term'!$D$2:$J$942,13,FALSE)),\"\")","v":""},{"$f":"IFERROR(IF(D11=\"\",\"\",VLOOKUP(C11,'Cover Sheet - Spring Term'!$D$2:$J$942,14,FALSE)),\"\")","v":""}]
[null,"",{"$error":"#N/A"},{"$f":"IFERROR(IF(C12=\"\",\"\",VLOOKUP(C12,'Cover Sheet - Spring Term'!$D$2:$F$942,7,FALSE)),\"\")","v":""},{"$f":"IF(H12=\"\",\"\",VLOOKUP(H12,'Cover Sheet - Spring Term'!$F$3:$J$918,3,FALSE))","v":""},"","",{"$f":"IFERROR(IF(C12=\"\",\"\",VLOOKUP(C12,'Cover Sheet - Spring Term'!$D$2:$J$942,18,FALSE)),\"\")","v":""},{"$f":"IFERROR(IF(C12=\"\",\"\",VLOOKUP(C12,'Cover Sheet - Spring Term'!$D$2:$J$942,11,FALSE)),\"\")","v":""},{"$f":"IFERROR(IF(C12=\"\",\"\",VLOOKUP(C12,'Cover Sheet - Spring Term'!$D$2:$J$942,10,FALSE)),\"\")","v":""},{"$f":"IFERROR(IF(B12=\"\",\"\",VLOOKUP(B12,'Cover Sheet - Spring Term'!$D$2:$J$942,12,FALSE)),\"\")","v":""},{"$f":"IFERROR(IF(C12=\"\",\"\",VLOOKUP(C12,'Cover Sheet - Spring Term'!$D$2:$J$942,13,FALSE)),\"\")","v":""},{"$f":"IFERROR(IF(D12=\"\",\"\",VLOOKUP(C12,'Cover Sheet - Spring Term'!$D$2:$J$942,14,FALSE)),\"\")","v":""}]
[null,"",{"$error":"#N/A"},{"$f":"IFERROR(IF(C13=\"\",\"\",VLOOKUP(C13,'Cover Sheet - Spring Term'!$D$2:$F$942,7,FALSE)),\"\")","v":""},{"$f":"IF(H13=\"\",\"\",VLOOKUP(H13,'Cover Sheet - Spring Term'!$F$3:$J$918,3,FALSE))","v":""},"","",{"$f":"IFERROR(IF(C13=\"\",\"\",VLOOKUP(C13,'Cover Sheet - Spring Term'!$D$2:$J$942,18,FALSE)),\"\")","v":""},{"$f":"IFERROR(IF(C13=\"\",\"\",VLOOKUP(C13,'Cover Sheet - Spring Term'!$D$2:$J$942,11,FALSE)),\"\")","v":""},{"$f":"IFERROR(IF(C13=\"\",\"\",VLOOKUP(C13,'Cover Sheet - Spring Term'!$D$2:$J$942,10,FALSE)),\"\")","v":""},{"$f":"IFERROR(IF(B13=\"\",\"\",VLOOKUP(B13,'Cover Sheet - Spring Term'!$D$2:$J$942,12,FALSE)),\"\")","v":""},{"$f":"IFERROR(IF(C13=\"\",\"\",VLOOKUP(C13,'Cover Sheet - Spring Term'!$D$2:$J$942,13,FALSE)),\"\")","v":""},{"$f":"IFERROR(IF(D13=\"\",\"\",VLOOKUP(C13,'Cover Sheet - Spring Term'!$D$2:$J$942,14,FALSE)),\"\")","v":""}]
[null,"",{"$error":"#N/A"},{"$f":"IFERROR(IF(C14=\"\",\"\",VLOOKUP(C14,'Cover Sheet - Spring Term'!$D$2:$F$942,7,FALSE)),\"\")","v":""},{"$f":"IF(H14=\"\",\"\",VLOOKUP(H14,'Cover Sheet - Spring Term'!$F$3:$J$918,3,FALSE))","v":""},"","",{"$f":"IFERROR(IF(C14=\"\",\"\",VLOOKUP(C14,'Cover Sheet - Spring Term'!$D$2:$J$942,18,FALSE)),\"\")","v":""},{"$f":"IFERROR(IF(C14=\"\",\"\",VLOOKUP(C14,'Cover Sheet - Spring Term'!$D$2:$J$942,11,FALSE)),\"\")","v":""},{"$f":"IFERROR(IF(C14=\"\",\"\",VLOOKUP(C14,'Cover Sheet - Spring Term'!$D$2:$J$942,10,FALSE)),\"\")","v":""},{"$f":"IFERROR(IF(B14=\"\",\"\",VLOOKUP(B14,'Cover Sheet - Spring Term'!$D$2:$J$942,12,FALSE)),\"\")","v":""},{"$f":"IFERROR(IF(C14=\"\",\"\",VLOOKUP(C14,'Cover Sheet - Spring Term'!$D$2:$J$942,13,FALSE)),\"\")","v":""},{"$f":"IFERROR(IF(D14=\"\",\"\",VLOOKUP(C14,'Cover Sheet - Spring Term'!$D$2:$J$942,14,FALSE)),\"\")","v":""}]
[null,"",{"$error":"#N/A"},{"$f":"IFERROR(IF(C15=\"\",\"\",VLOOKUP(C15,'Cover Sheet - Spring Term'!$D$2:$F$942,7,FALSE)),\"\")","v":""},{"$f":"IF(H15=\"\",\"\",VLOOKUP(H15,'Cover Sheet - Spring Term'!$F$3:$J$918,3,FALSE))","v":""},"","",{"$f":"IFERROR(IF(C15=\"\",\"\",VLOOKUP(C15,'Cover Sheet - Spring Term'!$D$2:$J$942,18,FALSE)),\"\")","v":""},{"$f":"IFERROR(IF(C15=\"\",\"\",VLOOKUP(C15,'Cover Sheet - Spring Term'!$D$2:$J$942,11,FALSE)),\"\")","v":""},{"$f":"IFERROR(IF(C15=\"\",\"\",VLOOKUP(C15,'Cover Sheet - Spring Term'!$D$2:$J$942,10,FALSE)),\"\")","v":""},{"$f":"IFERROR(IF(B15=\"\",\"\",VLOOKUP(B15,'Cover Sheet - Spring Term'!$D$2:$J$942,12,FALSE)),\"\")","v":""},{"$f":"IFERROR(IF(C15=\"\",\"\",VLOOKUP(C15,'Cover Sheet - Spring Term'!$D$2:$J$942,13,FALSE)),\"\")","v":""},{"$f":"IFERROR(IF(D15=\"\",\"\",VLOOKUP(C15,'Cover Sheet - Spring Term'!$D$2:$J$942,14,FALSE)),\"\")","v":""}]
{"$rows_left_out":67}
{"sheet":"Lists","index":5,"n_rows":14,"n_cols":16,"rows_kept":14,"cut":false,"hidden":true,"merged":[]}
["Year",null,null,"Year7Chemistry",null,null,"Year8Physics",null,null,"Year9Chemistry",null,null,"Year10Biology",null,null,"Year11Biology"]
["Year 7",7,null,{"$f":"IF('Overview (LTP)'!#REF!=\"\",\"\",IFERROR('Overview (LTP)'!#REF!,\"\"))","v":{"$error":"#REF!"}},null,null,{"$f":"IF('Overview (LTP)'!#REF!=\"\",\"\",IFERROR('Overview (LTP)'!#REF!,\"\"))","v":{"$error":"#REF!"}},null,null,{"$f":"IF('Overview (LTP)'!#REF!=\"\",\"\",IFERROR('Overview (LTP)'!#REF!,\"\"))","v":{"$error":"#REF!"}},null,null,{"$f":"IF('Overview (LTP)'!#REF!=\"\",\"\",IFERROR('Overview (LTP)'!#REF!,\"\"))","v":{"$error":"#REF!"}},null,null,{"$f":"IF('Overview (LTP)'!#REF!=\"\",\"\",IFERROR('Overview (LTP)'!#REF!,\"\"))","v":{"$error":"#REF!"}}]
["Year 8",8,null,{"$f":"IF('Overview (LTP)'!#REF!=\"\",\"\",IFERROR('Overview (LTP)'!#REF!,\"\"))","v":{"$error":"#REF!"}},null,null,{"$f":"IF('Overview (LTP)'!#REF!=\"\",\"\",IFERROR('Overview (LTP)'!#REF!,\"\"))","v":{"$error":"#REF!"}},null,null,{"$f":"IF('Overview (LTP)'!#REF!=\"\",\"\",IFERROR('Overview (LTP)'!#REF!,\"\"))","v":{"$error":"#REF!"}},null,null,{"$f":"IF('Overview (LTP)'!#REF!=\"\",\"\",IFERROR('Overview (LTP)'!#REF!,\"\"))","v":{"$error":"#REF!"}}]
["Year 9",9]
["Year 10",10,null,"Year7Physics",null,null,"Year8Chemistry",null,null,"Year9Physics",null,null,"Year10Physics",null,null,"Year11Chemistry"]
["Year 11",11,null,{"$f":"IF('Overview (LTP)'!#REF!=\"\",\"\",IFERROR('Overview (LTP)'!#REF!,\"\"))","v":{"$error":"#REF!"}},null,null,{"$f":"IF('Overview (LTP)'!#REF!=\"\",\"\",IFERROR('Overview (LTP)'!#REF!,\"\"))","v":{"$error":"#REF!"}},null,null,{"$f":"IF('Overview (LTP)'!#REF!=\"\",\"\",IFERROR('Overview (LTP)'!#REF!,\"\"))","v":{"$error":"#REF!"}},null,null,{"$f":"IF('Overview (LTP)'!#REF!=\"\",\"\",IFERROR('Overview (LTP)'!#REF!,\"\"))","v":{"$error":"#REF!"}},null,null,{"$f":"IF('Overview (LTP)'!#REF!=\"\",\"\",IFERROR('Overview (LTP)'!#REF!,\"\"))","v":{"$error":"#REF!"}}]
[null,null,null,{"$f":"IF('Overview (LTP)'!#REF!=\"\",\"\",IFERROR('Overview (LTP)'!#REF!,\"\"))","v":{"$error":"#REF!"}},null,null,{"$f":"IF('Overview (LTP)'!#REF!=\"\",\"\",IFERROR('Overview (LTP)'!#REF!,\"\"))","v":{"$error":"#REF!"}},null,null,{"$f":"IF('Overview (LTP)'!#REF!=\"\",\"\",IFERROR('Overview (LTP)'!#REF!,\"\"))","v":{"$error":"#REF!"}},null,null,{"$f":"IF('Overview (LTP)'!#REF!=\"\",\"\",IFERROR('Overview (LTP)'!#REF!,\"\"))","v":{"$error":"#REF!"}}]
[]
[null,null,null,"Year7Biology",null,null,"Year8Biology",null,null,"Year9Biology",null,null,"Year10Chemistry",null,null,"Year11Physics"]
[null,null,null,{"$f":"IF('Overview (LTP)'!#REF!=\"\",\"\",IFERROR('Overview (LTP)'!#REF!,\"\"))","v":{"$error":"#REF!"}},null,null,{"$f":"IF('Overview (LTP)'!#REF!=\"\",\"\",IFERROR('Overview (LTP)'!#REF!,\"\"))","v":{"$error":"#REF!"}},null,null,{"$f":"IF('Overview (LTP)'!#REF!=\"\",\"\",IFERROR('Overview (LTP)'!#REF!,\"\"))","v":{"$error":"#REF!"}},null,null,{"$f":"IF('Overview (LTP)'!#REF!=\"\",\"\",IFERROR('Overview (LTP)'!#REF!,\"\"))","v":{"$error":"#REF!"}},null,null,{"$f":"IF('Overview (LTP)'!#REF!=\"\",\"\",IFERROR('Overview (LTP)'!#REF!,\"\"))","v":{"$error":"#REF!"}}]
["Subject",null,null,{"$f":"IF('Overview (LTP)'!#REF!=\"\",\"\",IFERROR('Overview (LTP)'!#REF!,\"\"))","v":{"$error":"#REF!"}},null,null,{"$f":"IF('Overview (LTP)'!#REF!=\"\",\"\",IFERROR('Overview (LTP)'!#REF!,\"\"))","v":{"$error":"#REF!"}},null,null,{"$f":"IF('Overview (LTP)'!#REF!=\"\",\"\",IFERROR('Overview (LTP)'!#REF!,\"\"))","v":{"$error":"#REF!"}},null,null,{"$f":"IF('Overview (LTP)'!#REF!=\"\",\"\",IFERROR('Overview (LTP)'!#REF!,\"\"))","v":{"$error":"#REF!"}}]
["Biology","B"]
["Chemistry","C"]
["Physics","P"]